# Building julia 1.0 for windows

**URL:** <https://discourse.julialang.org/t/building-julia-1-0-for-windows/15897>\
**Category:** General Usage\
**Created:** [October 4, 2018, 7:45pm UTC](https://discourse.julialang.org/t/building-julia-1-0-for-windows/15897 "2018-10-04T19:45:39Z")\
**Posts on this page:** 8\
**Page:** 1

<div class="post-metadata">

**Author:** ![oheil](https://sea2.discourse-cdn.com/julialang/user_avatar/discourse.julialang.org/oheil/32/220745_2.png) [@oheil](https://discourse.julialang.org/u/oheil)\
**Post date:** [October 4, 2018, 7:45pm UTC](https://discourse.julialang.org/t/building-julia-1-0-for-windows/15897/1 "2018-10-04T19:45:39Z")

</div>

I am not able to build julia 1.0 for windows following the Cygwin-to-MinGW cross-compiling build procedure described here:  
[https://github.com/JuliaLang/julia/blob/master/README.windows.md](https://github.com/JuliaLang/julia/blob/master/README.windows.md)

The following linker error is the problem:

```julia
[81%] Linking CXX shared library ../../bin/LLVM.dll
[81%] Built target llvm-cfi-verify
../../lib/libLLVMAMDGPUCodeGen.a(AMDGPUISelDAGToDAG.cpp.obj):AMDGPUISelDAGToDAG.cpp:(.text$_ZN4llvm16SelectionDAGISel22getIncludePathForIndexEj+0x0): Mehrfachdefinition von »llvm::SelectionDAGISel::getIncludePathForIndex(unsigned int)«
../../lib/libLLVMSelectionDAG.a(SelectionDAGISel.cpp.obj):SelectionDAGISel.cpp:(.text$_ZN4llvm16SelectionDAGISel22getIncludePathForIndexEj+0x0): hier zuerst definiert
../../lib/libLLVMAMDGPUCodeGen.a(AMDGPUISelDAGToDAG.cpp.obj):AMDGPUISelDAGToDAG.cpp:(.text$_ZN4llvm16SelectionDAGISel18getPatternForIndexEj+0x0): Mehrfachdefinition von »llvm::SelectionDAGISel::getPatternForIndex(unsigned int)«
../../lib/libLLVMSelectionDAG.a(SelectionDAGISel.cpp.obj):SelectionDAGISel.cpp:(.text$_ZN4llvm16SelectionDAGISel18getPatternForIndexEj+0x0): hier zuerst definiert
collect2: Fehler: ld gab 1 als Ende-Status zurück
make[4]: *** [tools/llvm-shlib/CMakeFiles/LLVM.dir/build.make:213: bin/LLVM.dll] Fehler 1
make[3]: *** [CMakeFiles/Makefile2:17100: tools/llvm-shlib/CMakeFiles/LLVM.dir/all] Fehler 2
make[2]: *** [Makefile:150: all] Fehler 2
make[1]: *** [/home/Oli/julia/deps/llvm.mk:450: scratch/llvm-6.0.1/build_Release/build-compiled] Fehler 2
make[1]: *** Es wird auf noch nicht beendete Prozesse gewartet....

```

In english it is:

```julia
Redefinition of llvm::SelectionDAGISel::getIncludePathForIndex(unsigned int)

```

first definition in

```julia
../../lib/libLLVMSelectionDAG.a(SelectionDAGISel.cpp.obj):SelectionDAGISel.cpp:

```

second in

```julia
../../lib/libLLVMAMDGPUCodeGen.a(AMDGPUISelDAGToDAG.cpp.obj):AMDGPUISelDAGToDAG.cpp:

```

How to overcome this?

---

<div class="post-metadata">

**Author:** ![oheil](https://sea2.discourse-cdn.com/julialang/user_avatar/discourse.julialang.org/oheil/32/220745_2.png) [@oheil](https://discourse.julialang.org/u/oheil)\
**Post date:** [October 4, 2018, 7:48pm UTC](https://discourse.julialang.org/t/building-julia-1-0-for-windows/15897/2 "2018-10-04T19:48:12Z")

</div>

Building 0.7 works well, so it is not the build setup of the cygwin installation (probably).

---

<div class="post-metadata">

**Author:** ![musm](https://sea2.discourse-cdn.com/julialang/user_avatar/discourse.julialang.org/musm/32/3675_2.png) [@musm](https://discourse.julialang.org/u/musm)\
**Post date:** [October 4, 2018, 7:53pm UTC](https://discourse.julialang.org/t/building-julia-1-0-for-windows/15897/3 "2018-10-04T19:53:50Z")

</div>

I would post an issue in the main julia github repo.

For example I am unable to cross-compile windows.

Also take a look at the appveyor script [https://github.com/JuliaLang/julia/blob/master/appveyor.yml](https://github.com/JuliaLang/julia/blob/master/appveyor.yml)

I think in the past I have ran `appveyor_build.sh` sucessfully.

---

<div class="post-metadata">

**Author:** ![oheil](https://sea2.discourse-cdn.com/julialang/user_avatar/discourse.julialang.org/oheil/32/220745_2.png) [@oheil](https://discourse.julialang.org/u/oheil)\
**Post date:** [October 5, 2018, 9:43am UTC](https://discourse.julialang.org/t/building-julia-1-0-for-windows/15897/4 "2018-10-05T09:43:25Z")

</div>

Thanks for the help. Looking into  
`contrib\windows\appveyor_build.sh`  
made the build happen.  
The complete steps to a successfull 64 bit windows build:

1. start from windows build document [https://github.com/JuliaLang/julia/blob/master/README.windows.md](https://github.com/JuliaLang/julia/blob/master/README.windows.md)

2. Install additional cygwin pakages:  
ccache in Category Devel  
libpcre2-devel in Libs

3. open cygwin terminal

```julia
    git clone https://github.com/JuliaLang/julia.git
    cd julia
    export ARCH="x86_64"
    contrib/windows/appveyor_build.sh

```

The build still ends with an error but this is only after calling  
`make build-stats`  
The error is:

```julia
\033[34;1m ==> ./julia launch speedtest\033[0m
make: time: Kommando nicht gefunden
make: *** [Makefile:640: build-stats] Fehler 127

```

despite the time command is found when called from the shell.  
But this is not important for me, I just need a running local build for experiments.

On some branches/commits the build fails for sysimg.jl with errors like:

```julia
LoadError("sysimg.jl", 517, LoadError("C:\\cygwin64\\home\\oheil\\julia\\usr\\share\\julia\\site\\v0.7\\SharedArrays\\src\\SharedArrays.jl", 20, ArgumentError("Module Printf not found in current path.\nRun `Pkg.add(\"Printf\")` to install the Printf package.")))
***This error is usually fixed by running `make clean`. If the error persists, try `make cleanall`.***

```

This error in SharedArrays.jl can be fixed by changing line  
`using Printf: @sprintf`  
to  
`using Base.Printf: @sprintf`

Other similar error messages in other files typically complain about Pkg not in the path, e.g.:

```julia
LoadError("sysimg.jl", 520, LoadError("C:\\cygwin64\\home\\oheil\\julia\\usr\\share\\julia\\site\\v0.7\\Test\\src\\Test.jl", 32, LoadError("C:\\cygwin64\\home\\oheil\\julia\\usr\\share\\julia\\site\\v0.7\\InteractiveUtils\\src\\InteractiveUtils.jl", 18, ArgumentError("Module Pkg not found in current path.\nRun `Pkg.add(\"Pkg\")` to install the Pkg package."))))
***This error is usually fixed by running `make clean`. If the error persists, try `make cleanall`.***

```

All these can be fixed by changing line  
`import Pkg`  
to  
`import ..Pkg`

---

<div class="post-metadata">

**Author:** ![musm](https://sea2.discourse-cdn.com/julialang/user_avatar/discourse.julialang.org/musm/32/3675_2.png) [@musm](https://discourse.julialang.org/u/musm)\
**Post date:** [October 8, 2018, 8:12pm UTC](https://discourse.julialang.org/t/building-julia-1-0-for-windows/15897/5 "2018-10-08T20:12:12Z")

</div>

Is it possible to take advantage of conpty in newer version of windows?  
[https://www.bing.com/search?q=conpty&PC=U316&FORM=CHROMN](https://www.bing.com/search?q=conpty&PC=U316&FORM=CHROMN)

---

<div class="post-metadata">

**Author:** ![oheil](https://sea2.discourse-cdn.com/julialang/user_avatar/discourse.julialang.org/oheil/32/220745_2.png) [@oheil](https://discourse.julialang.org/u/oheil)\
**Post date:** [October 26, 2018, 11:45am UTC](https://discourse.julialang.org/t/building-julia-1-0-for-windows/15897/6 "2018-10-26T11:45:43Z")

</div>

Added some workarounds for common build error.

---

<div class="post-metadata">

**Author:** ![musm](https://sea2.discourse-cdn.com/julialang/user_avatar/discourse.julialang.org/musm/32/3675_2.png) [@musm](https://discourse.julialang.org/u/musm)\
**Post date:** [October 26, 2018, 3:27pm UTC](https://discourse.julialang.org/t/building-julia-1-0-for-windows/15897/7 "2018-10-26T15:27:53Z")

</div>

> [@oheil](#):
>
> `import ..Pkg`

@oheil You should be able to build julia without any issues using Cygwin with regular  
`make` command

which directory are you trying to build to?

E.g. I am successfully able to build a cross-compiled version with cygwin in `C:\Users\USERNAME\julia`

I suggest you run the cygwin installer again and _make sure you have the latest version of the require packages_ and also hit the test button in the upper right corner of the available packages and install the test versions of mingw32 ld and ming32 bindeps .

---

<div class="post-metadata">

**Author:** ![oheil](https://sea2.discourse-cdn.com/julialang/user_avatar/discourse.julialang.org/oheil/32/220745_2.png) [@oheil](https://discourse.julialang.org/u/oheil)\
**Post date:** [October 26, 2018, 8:53pm UTC](https://discourse.julialang.org/t/building-julia-1-0-for-windows/15897/8 "2018-10-26T20:53:02Z")

</div>

Thanks fo your reply.  
The build problems I have are in the context of  
[https://github.com/JuliaLang/julia/issues/26422](https://github.com/JuliaLang/julia/issues/26422)  
(you have participated there too)  
With my update here I just tried to have all solutions of my build problems at a single place for future reference. Maybe I am just a little bit chaotic and I am sorry if I produce confusion.
